Target
Mitogen-activated protein kinase 1
Ligand
BDBM497758
Substrate
Meas. Tech.
ERK2 In vitro Inhibition Assay
IC50
2.00±n/a nM
Citation
 Berdini, VBuck, IMDay, JEGriffiths-Jones, CMHeightman, TDHoward, SMurray, CWNorton, DO''Reilly, MWoolford, AJCooke, MLCousin, DOnions, STShannon, JMWatts, JP Benzolactam compounds as protein kinase inhibitors US Patent  US11001575 Publication Date 5/11/2021 
Target
Name:
Mitogen-activated protein kinase 1
Synonyms:
ERK2 Extracellular signal-regulated kinase 2 Extracellular signal-regulated kinase 2 (ERK2) MAPK 2 MK01_HUMAN Mitogen-activated protein kinase 1 (ERK-2) Mitogen-activated protein kinase 2 PRKM2 | p42-MAPK
Type:
Ser/Thr Protein Kinase
Mol. Mass.:
41392.76
Organism:
Homo sapiens (Human)
Description:
P28482
Residue:
360
  
Inhibitor
Name:
BDBM497758
Synonyms:
2-(6-{5-chloro-2- [(oxan-4- yl)amino]pyrimidin-4- yl}-1-oxo-2,3-dihydro- 1H-isoindol-2-yl)-N-[2- (3- methoxyphenyl)propan- 2-yl]acetamide | US11001575, Example 588
Type:
Small organic molecule
Emp. Form.:
C29H31ClFN5O4
Mol. Mass.:
568.039
SMILES:
C[C@H](O)[C@@H](NC(=O)CN1Cc2ccc(cc2C1=O)-c1nc(NC2CCOCC2)ncc1Cl)c1cc(C)cc(F)c1
: