Target
Mitogen-activated protein kinase 1
Ligand
BDBM418089
Substrate
Meas. Tech.
ERK2 In vitro Inhibition Assay
IC50
1.70±n/a nM
Citation
 Berdini, VBuck, IMDay, JEGriffiths-Jones, CMHeightman, TDHoward, SMurray, CWNorton, DO''Reilly, MWoolford, AJCooke, MLCousin, DOnions, STShannon, JMWatts, JP Benzolactam compounds as protein kinase inhibitors US Patent  US11001575 Publication Date 5/11/2021 
Target
Name:
Mitogen-activated protein kinase 1
Synonyms:
ERK2 Extracellular signal-regulated kinase 2 Extracellular signal-regulated kinase 2 (ERK2) MAPK 2 MK01_HUMAN Mitogen-activated protein kinase 1 (ERK-2) Mitogen-activated protein kinase 2 PRKM2 | p42-MAPK
Type:
Ser/Thr Protein Kinase
Mol. Mass.:
41392.76
Organism:
Homo sapiens (Human)
Description:
P28482
Residue:
360
  
Inhibitor
Name:
BDBM418089
Synonyms:
(2R)-2-{6-[5-chloro-2- (methylamino)pyrimidin-4-yl]-1-oxo- 2,3-dihydro-1H-isoindol-2-yl}-N-[(1S)- 1-[6-(dimethylamino)pyridin-2-yl]-2- hydroxyethyl]propanamide US11001575, Example 803
Type:
Small organic molecule
Emp. Form.:
C25H28ClN7O3
Mol. Mass.:
509.988
SMILES:
CNc1ncc(Cl)c(n1)-c1ccc2CN([C@H](C)C(=O)N[C@H](CO)c3cccc(n3)N(C)C)C(=O)c2c1
: