Target
Plasma kallikrein
Ligand
BDBM283464
Substrate
Meas. Tech.
In Vitro Enzyme Inhibition
IC50
<100±n/a nM
Citation
 McDonald, AQian, S Therapeutic inhibitory compounds US Patent  US11021463 Publication Date 6/1/2021 
Target
Name:
Plasma kallikrein
Synonyms:
Fletcher factor KLKB1 Kallikrein Plasma kallikrein heavy chain Plasma prekallikrein
Type:
Protein
Mol. Mass.:
71391.16
Organism:
Homo sapiens (Human)
Description:
P03952
Residue:
638
  
Inhibitor
Name:
BDBM283464
Synonyms:
N-((3-chloro-6-fluoro-1H-indol-5-yl)methyl)-2- ((6-methylquinolin-3-yl)methyl)isonicotinamide US10266515, Example 116 US11021463, Example 116 | US9611252, Example 116
Type:
Small organic molecule
Emp. Form.:
C26H20ClFN4O
Mol. Mass.:
458.915
SMILES:
Cc1ccc2ncc(Cc3cc(ccn3)C(=O)NCc3cc4c(Cl)c[nH]c4cc3F)cc2c1
: