Target
Mitogen-activated protein kinase kinase kinase kinase 1
Ligand
BDBM500489
Substrate
Meas. Tech.
Biochemical Enzyme Assay
IC50
<100±n/a nM
Citation
 Kaila, NLinney, IWard, SWishart, GWhittaker, BCote, AGreenwood, JRLeffler, AAlbanese, SKSeverance, DL Substituted isoindolin-1-ones and 2,3-dihydro-1h-pyrrolo[3,4-c]pyridin-1-ones as HPK1 antagonists US Patent  US11021481 Publication Date 6/1/2021 
Target
Name:
Mitogen-activated protein kinase kinase kinase kinase 1
Synonyms:
HPK1 MAP4K1
Type:
PROTEIN
Mol. Mass.:
91316.07
Organism:
Homo sapiens (Human)
Description:
ChEMBL_586597
Residue:
833
  
Inhibitor
Name:
BDBM500489
Synonyms:
4-(7- methylimidazo [1,2-a]pyridin- 3-yl)-7-[(5- methylsulfony 1-2-pyridyl)amino] isoindolin-1-one US11078201, Compound I-148 | US11548890, Compound I-148
Type:
Small organic molecule
Emp. Form.:
C22H19N5O3S
Mol. Mass.:
433.483
SMILES:
Cc1ccn2c(cnc2c1)-c1ccc(Nc2ccc(cn2)S(C)(=O)=O)c2C(=O)NCc12
: