Target
Mitogen-activated protein kinase kinase kinase kinase 1
Ligand
BDBM501023
Substrate
Meas. Tech.
Biochemical Enzyme Assay
IC50
<100±n/a nM
Citation
 Kaila, NLinney, IWard, SWishart, GWhittaker, BCote, AGreenwood, JRLeffler, AAlbanese, SKSeverance, DL Substituted isoindolin-1-ones and 2,3-dihydro-1h-pyrrolo[3,4-c]pyridin-1-ones as HPK1 antagonists US Patent  US11021481 Publication Date 6/1/2021 
Target
Name:
Mitogen-activated protein kinase kinase kinase kinase 1
Synonyms:
HPK1 MAP4K1
Type:
PROTEIN
Mol. Mass.:
91316.07
Organism:
Homo sapiens (Human)
Description:
ChEMBL_586597
Residue:
833
  
Inhibitor
Name:
BDBM501023
Synonyms:
(S)-7-((6- ((dimethylamino)- methyl)-5- (tetrahydrofuran- 3-yl)pyridin- 2-yl)amino)-4- (8-methylimidazo [1,2-a]pyridin- 3-yl)isoindolin- 1-one US11021481, Compound I-696
Type:
Small organic molecule
Emp. Form.:
C27H29N7O2
Mol. Mass.:
483.5649
SMILES:
CN(C)Cc1nc(Nc2ccc(c3CNC(=O)c23)-c2cnc3c(C)cccn23)ccc1N1CCOC1
: