Target
Mitogen-activated protein kinase kinase kinase kinase 1
Ligand
BDBM501044
Substrate
Meas. Tech.
Biochemical Enzyme Assay
IC50
<100±n/a nM
Citation
 Kaila, NLinney, IWard, SWishart, GWhittaker, BCote, AGreenwood, JRLeffler, AAlbanese, SKSeverance, DL Substituted isoindolin-1-ones and 2,3-dihydro-1h-pyrrolo[3,4-c]pyridin-1-ones as HPK1 antagonists US Patent  US11021481 Publication Date 6/1/2021 
Target
Name:
Mitogen-activated protein kinase kinase kinase kinase 1
Synonyms:
HPK1 MAP4K1
Type:
PROTEIN
Mol. Mass.:
91316.07
Organism:
Homo sapiens (Human)
Description:
ChEMBL_586597
Residue:
833
  
Inhibitor
Name:
BDBM501044
Synonyms:
(R)-7-((5-(3-(2- (dimethylainin o)propan-2-yl)- 3-hydroxy- piperidin-1- yl)pyridin-2- yl)amino)-4-(7- fluoroimidazo [1,2-a]pyridin- 3-yl)isoindolin- 1-one US11078201, Compound I-716 | US11548890, Compound I-716
Type:
Small organic molecule
Emp. Form.:
C30H34FN7O2
Mol. Mass.:
543.6351
SMILES:
CN(C)C(C)(C)[C@@]1(O)CCCN(C1)c1ccc(Nc2ccc(c3CNC(=O)c23)-c2cnc3cc(F)ccn23)nc1
: