Target
Mitogen-activated protein kinase kinase kinase kinase 1
Ligand
BDBM501048
Substrate
Meas. Tech.
Biochemical Enzyme Assay
IC50
<100±n/a nM
Citation
 Kaila, NLinney, IWard, SWishart, GWhittaker, BCote, AGreenwood, JRLeffler, AAlbanese, SKSeverance, DL Substituted isoindolin-1-ones and 2,3-dihydro-1h-pyrrolo[3,4-c]pyridin-1-ones as HPK1 antagonists US Patent  US11021481 Publication Date 6/1/2021 
Target
Name:
Mitogen-activated protein kinase kinase kinase kinase 1
Synonyms:
HPK1 MAP4K1
Type:
PROTEIN
Mol. Mass.:
91316.07
Organism:
Homo sapiens (Human)
Description:
ChEMBL_586597
Residue:
833
  
Inhibitor
Name:
BDBM501048
Synonyms:
(SMK7- fluoroimidazo [1,2-a]pyridin- 3-yl)-7-((6- (morpholinom ethyl)-5- (tetrahydrofuran- 3-yl)pyridin-2- yl)amino)isoin- dolin-1-one US11078201, Compound I-720 | US11548890, Compound I-720
Type:
Small organic molecule
Emp. Form.:
C29H29FN6O3
Mol. Mass.:
528.5774
SMILES:
Fc1ccn2c(cnc2c1)-c1ccc(Nc2ccc([C@H]3CCOC3)c(CN3CCOCC3)n2)c2C(=O)NCc12
: