Target
Sodium channel protein type 9 subunit alpha
Ligand
BDBM501868
Substrate
Meas. Tech.
Electrophysiological Assay (EP) (In Vitro Assay)
IC50
3.13±n/a nM
Citation
 Sutherlin, DMcKerrall, SLai, KWLiu, ZLiu, WBeveridge, RLeclerc, JLemire, AZhao, LSturino, C Therapeutic compounds and methods of use thereof US Patent  US11028075 Publication Date 6/8/2021 
Target
Name:
Sodium channel protein type 9 subunit alpha
Synonyms:
NENA Peripheral sodium channel 1 SCN9A_HUMAN Voltage-gated sodium channel subunit Nav1.7 hNE-Na
Type:
Protein
Mol. Mass.:
226375.97
Organism:
Homo sapiens (Human)
Description:
Q15858
Residue:
1988
  
Inhibitor
Name:
BDBM501868
Synonyms:
US11028075, Example 1
Type:
Small organic molecule
Emp. Form.:
C27H27F4N5O4S
Mol. Mass.:
593.593
SMILES:
CN(C)[C@H]1C[C@H](CC[C@@H]1N1C(=O)COc2cc(c(F)cc12)S(=O)(=O)Nc1ccncn1)c1cccc(c1)C(F)(F)F
: