Target
Diacylglycerol O-acyltransferase 2
Ligand
BDBM276754
Substrate
Meas. Tech.
In Vitro Assay
IC50
196±n/a nM
Citation
 Boehm, MCabral, SDowling, MSFutatsugi, KHuard, KLee, ECLondregan, ATPolivkova, JPrice, DALi, Q Diacylglycerol acyl transferase 2 inhibitors US Patent  US11034678 Publication Date 6/15/2021 
Target
Name:
Diacylglycerol O-acyltransferase 2
Synonyms:
ARAT DGAT2 Diacylglycerol O-acyltransferase 2 (DGAT2) Retinol O-fatty-acyltransferase
Type:
Multi-pass membrane protein
Mol. Mass.:
43848.90
Organism:
Homo sapiens (Human)
Description:
Q96PD7
Residue:
388
  
Inhibitor
Name:
BDBM276754
Synonyms:
N-(1,1-dioxidotetrahydro- thiophen-3-yl)-2-(5-((3- ethoxypyridin-2-yl)oxy) pyridin-3-yl)pyrimidine- 5-carboxamide US11034678, Example 3.3 WO2018033832, Ex. 3.3
Type:
Small organic molecule
Emp. Form.:
C21H21N5O5S
Mol. Mass.:
455.487
SMILES:
CCOc1cccnc1Oc1cncc(c1)-c1ncc(cn1)C(=O)NC1CCS(=O)(=O)C1
: