Target
Sphingosine 1-phosphate receptor 4
Ligand
BDBM399298
Substrate
Meas. Tech.
Competition Binding Assay
IC50
23500±n/a nM
Citation
 Roberts, ERosen, HUrbano, MGuerrero, M Sphinogosine-1 -phosphate receptor modulators for treatment of cardiopulmonary disorders US Patent  US11034691 Publication Date 6/15/2021 
Target
Name:
Sphingosine 1-phosphate receptor 4
Synonyms:
EDG6 S1P receptor 4 S1P4 S1PR4_HUMAN Sphingosine 1-phosphate receptor Edg-6 sphingosine-1-phosphate 4 S1P4
Type:
G Protein-Coupled Receptor (GPCR)
Mol. Mass.:
41647.39
Organism:
Homo sapiens (Human)
Description:
Residue:
384
  
Inhibitor
Name:
BDBM399298
Synonyms:
US10323029, Generic formula 52604 IB | US11034691, CYM generic formula 52604 IB
Type:
Small organic molecule
Emp. Form.:
C21H11BrCl2N4O
Mol. Mass.:
486.148
SMILES:
Clc1ccc(cc1Cl)[C@H](NC(=O)c1ccc(C#N)c(c1)C#N)c1ccc(Br)cn1
: