Target
Plasma kallikrein
Ligand
BDBM433404
Substrate
Meas. Tech.
Activity Assay
Ki
>100.0±n/a nM
Citation
 Kotian, PLBabu, YSKumar, VSZhang, WVogeti, L Human plasma kallikrein inhibitors US Patent  US11066360 Publication Date 7/20/2021 
Target
Name:
Plasma kallikrein
Synonyms:
Fletcher factor KLKB1 Kallikrein Plasma kallikrein heavy chain Plasma prekallikrein
Type:
Protein
Mol. Mass.:
71391.16
Organism:
Homo sapiens (Human)
Description:
P03952
Residue:
638
  
Inhibitor
Name:
BDBM433404
Synonyms:
US10562850, Compound 13e | US11066360, Compound 13e
Type:
Small organic molecule
Emp. Form.:
C30H30ClFN6O2
Mol. Mass.:
561.05
SMILES:
NC(CCC1CC1)(c1cccc(c1)C#N)c1ccc(F)c(NC(=O)[C@H]2CCCN2C(=O)Nc2ccc(Cl)cn2)c1
: