Target
P2X purinoceptor 7
Ligand
BDBM505237
Substrate
Meas. Tech.
Inhibition Assay
IC50
<10±n/a nM
Citation
 Masuda, KSugiyama, SYamada, TKojima, EOgawa, TKobayashi, NKai, H Bicyclic nitrogen-containing heterocyclic derivatives and pharmaceutical composition comprising the same US Patent  US11066409 Publication Date 7/20/2021 
Target
Name:
P2X purinoceptor 7
Synonyms:
ATP receptor P2RX7_HUMAN P2X purinoceptor 7 (P2X7) P2Z receptor | Purinergic receptor
Type:
Protein
Mol. Mass.:
68602.85
Organism:
Homo sapiens (Human)
Description:
Q99572
Residue:
595
  
Inhibitor
Name:
BDBM505237
Synonyms:
US11066409, Compound I-0099
Type:
Small organic molecule
Emp. Form.:
C21H17F4N3O2
Mol. Mass.:
419.3722
SMILES:
COc1cc(Nc2nc(=O)c(F)c3CCC(c4cc(F)cc(F)c4)n23)c(C)cc1F
: