BDBM28583 5-chloro-N-[4-methoxy-3-(piperazin-1-yl)phenyl]-3-methyl-1-benzothiophene-2-sulfonamide hydrochloride::CHEMBL431298::SB 271046::SB-271046
SMILES COc1ccc(NS(=O)(=O)c2sc3ccc(Cl)cc3c2C)cc1N1CCNCC1
InChI Key InChIKey=LOCQRDBFWSXQQI-UHFFFAOYSA-N
Data  42 KI  6 IC50
  Tab Delimited (TSV)   2D SDfile   Computed 3D by Vconf -m prep SDfile
Find this compound or compounds like it in BindingDB:
Activity Spreadsheet -- Enzyme Inhibition Constant Data from BindingDB
Found 48 hits for monomerid = 28583
Target5-hydroxytryptamine receptor 6(Homo sapiens (Human))
Jagiellonian University
Curated by ChEMBL
LigandPNGBDBM28583(5-chloro-N-[4-methoxy-3-(piperazin-1-yl)phenyl]-3-...)
Affinity DataKi:  0.631nM. Assay description: Displacement of [3H]-LSD from human 5-HT6R expressed in human HeLa cells after 1 hr by liquid scintillation counting method
In DepthDetails ArticlePubMed
Target5-hydroxytryptamine receptor 6(Homo sapiens (Human))
Jagiellonian University
Curated by ChEMBL
LigandPNGBDBM28583(5-chloro-N-[4-methoxy-3-(piperazin-1-yl)phenyl]-3-...)
Affinity DataKi:  0.660nM ΔG°:  -12.4kcal/molepH: 7.5 T: 2°C. Assay description: Competition experiments were performed in the presence radioligand with membrane protein (obtained from cells expressing the receptor) and test compo...
In DepthDetails ArticlePubMed
Target5-hydroxytryptamine receptor 6(RAT)
Glaxosmithkline
Curated by PDSP Ki Database
LigandPNGBDBM28583(5-chloro-N-[4-methoxy-3-(piperazin-1-yl)phenyl]-3-...)
Affinity DataKi:  0.710nM
In DepthDetails ArticlePubMed
Target5-hydroxytryptamine receptor 6(Homo sapiens (Human))
Jagiellonian University
Curated by ChEMBL
LigandPNGBDBM28583(5-chloro-N-[4-methoxy-3-(piperazin-1-yl)phenyl]-3-...)
Affinity DataKi:  0.800nM. Assay description: Inhibition of [3H]-LSD binding to human 5-hydroxytryptamine 6 receptor expressed in HEK293 cells
In DepthDetails ArticlePubMed
Target5-hydroxytryptamine receptor 6(Homo sapiens (Human))
Jagiellonian University
Curated by ChEMBL
LigandPNGBDBM28583(5-chloro-N-[4-methoxy-3-(piperazin-1-yl)phenyl]-3-...)
Affinity DataKi:  0.810nM
In DepthDetails ArticlePubMed
Target5-hydroxytryptamine receptor 6(Homo sapiens (Human))
Jagiellonian University
Curated by ChEMBL
LigandPNGBDBM28583(5-chloro-N-[4-methoxy-3-(piperazin-1-yl)phenyl]-3-...)
Affinity DataKi:  1nM. Assay description: Binding affinity against 5 Hydroxy tryptamine 6 receptor
In DepthDetails ArticlePubMed
Target5-hydroxytryptamine receptor 6(Homo sapiens (Human))
Jagiellonian University
Curated by ChEMBL
LigandPNGBDBM28583(5-chloro-N-[4-methoxy-3-(piperazin-1-yl)phenyl]-3-...)
Affinity DataKi:  1nM. Assay description: Binding affinity towards human 5-hydroxytryptamine 6 receptor
In DepthDetails ArticlePubMed
Target5-hydroxytryptamine receptor 6(Homo sapiens (Human))
Jagiellonian University
Curated by ChEMBL
LigandPNGBDBM28583(5-chloro-N-[4-methoxy-3-(piperazin-1-yl)phenyl]-3-...)
Affinity DataKi:  1nM. Assay description: Displacement of [3H]-LSD from human cloned 5HT6 receptor expressed in HEK293 cells
In DepthDetails ArticlePubMed
Target5-hydroxytryptamine receptor 6(Homo sapiens (Human))
Jagiellonian University
Curated by ChEMBL
LigandPNGBDBM28583(5-chloro-N-[4-methoxy-3-(piperazin-1-yl)phenyl]-3-...)
Affinity DataKi:  1nM. Assay description: Binding affinity for human 5-hydroxytryptamine 6 receptorChecked by Author
In DepthDetails ArticlePubMed
Target5-hydroxytryptamine receptor 6(MOUSE)
Glaxosmithkline
Curated by PDSP Ki Database
LigandPNGBDBM28583(5-chloro-N-[4-methoxy-3-(piperazin-1-yl)phenyl]-3-...)
Affinity DataKi:  1.23nM
In DepthDetails ArticlePubMed
Target5-hydroxytryptamine receptor 6(Homo sapiens (Human))
Jagiellonian University
Curated by ChEMBL
LigandPNGBDBM28583(5-chloro-N-[4-methoxy-3-(piperazin-1-yl)phenyl]-3-...)
Affinity DataKi:  1.30nM. Assay description: Antagonist activity at human recombinant 5HT6 receptor expressed in CHO cells
In DepthDetails ArticlePubMed
Target5-hydroxytryptamine receptor 6(Homo sapiens (Human))
Jagiellonian University
Curated by ChEMBL
LigandPNGBDBM28583(5-chloro-N-[4-methoxy-3-(piperazin-1-yl)phenyl]-3-...)
Affinity DataKi:  1.30nM. Assay description: Displacement of [3H]-LSD from human 5-hydroxytryptamine 6 receptor expressed in HEK 293 cells
In DepthDetails ArticlePubMed
Target5-hydroxytryptamine receptor 6(Homo sapiens (Human))
Jagiellonian University
Curated by ChEMBL
LigandPNGBDBM28583(5-chloro-N-[4-methoxy-3-(piperazin-1-yl)phenyl]-3-...)
Affinity DataKi:  1.30nM. Assay description: Displacement of [3H]LSD from human 5-hydroxytryptamine 6 receptor expressed in HeLa cells
In DepthDetails ArticlePubMed
Target5-hydroxytryptamine receptor 6(Homo sapiens (Human))
Jagiellonian University
Curated by ChEMBL
LigandPNGBDBM28583(5-chloro-N-[4-methoxy-3-(piperazin-1-yl)phenyl]-3-...)
Affinity DataKi:  1.30nM. Assay description: Binding affinity against human 5-hydroxytryptamine 6 receptor
In DepthDetails ArticlePubMed
Target5-hydroxytryptamine receptor 6(Homo sapiens (Human))
Jagiellonian University
Curated by ChEMBL
LigandPNGBDBM28583(5-chloro-N-[4-methoxy-3-(piperazin-1-yl)phenyl]-3-...)
Affinity DataKi:  1.30nM. Assay description: The compound was tested for the binding affinity towards human cloned 5-hydroxytryptamine 6 receptor in HeLa cells, using [3H]LSD as radioligand; n=3
In DepthDetails ArticlePubMed
Target5-hydroxytryptamine receptor 6(Homo sapiens (Human))
Jagiellonian University
Curated by ChEMBL
LigandPNGBDBM28583(5-chloro-N-[4-methoxy-3-(piperazin-1-yl)phenyl]-3-...)
Affinity DataKi:  1.30nM. Assay description: Displacement of [3H]LSD from human 5HT6 receptor expressed in HeLa cells
In DepthDetails ArticlePubMed
Target5-hydroxytryptamine receptor 6(Homo sapiens (Human))
Jagiellonian University
Curated by ChEMBL
LigandPNGBDBM28583(5-chloro-N-[4-methoxy-3-(piperazin-1-yl)phenyl]-3-...)
Affinity DataKi:  1.70nM. Assay description: Displacement of [3H]LSD from human 5-HT6 receptor expressed in HEK293 cell membranes incubated for 60 mins by radioligand binding assay
In DepthDetails ArticlePubMed
Target5-hydroxytryptamine receptor 6(Homo sapiens (Human))
Jagiellonian University
Curated by ChEMBL
LigandPNGBDBM28583(5-chloro-N-[4-methoxy-3-(piperazin-1-yl)phenyl]-3-...)
Affinity DataKi:  3nM. Assay description: Displacement of [3H]LSD from human 5-HT6 receptor expressed in hamster BHK cells after 60 mins by scintillation counting analysis
In DepthDetails ArticlePubMed
Target5-hydroxytryptamine receptor 7(Homo sapiens (Human))
Normandie Univ
Curated by ChEMBL
LigandPNGBDBM28583(5-chloro-N-[4-methoxy-3-(piperazin-1-yl)phenyl]-3-...)
Affinity DataKi:  3nM. Assay description: Displacement of [3H]-LSD from human 5HT6 receptor expressed in BHK cell membrane measured after 60 mins by scintillation counter method
In DepthDetails ArticlePubMed
Target5-hydroxytryptamine receptor 6(Homo sapiens (Human))
Jagiellonian University
Curated by ChEMBL
LigandPNGBDBM28583(5-chloro-N-[4-methoxy-3-(piperazin-1-yl)phenyl]-3-...)
Affinity DataKi:  13nM. Assay description: Displacement of [3H]LSD from human 5HT6 receptor expressed in HEK293 cells by liquid scintillation counting
In DepthDetails ArticlePubMed
TargetD(1A) dopamine receptor(Homo sapiens (Human))
Korea Research Institute Of Chemical Technology
Curated by ChEMBL
LigandPNGBDBM28583(5-chloro-N-[4-methoxy-3-(piperazin-1-yl)phenyl]-3-...)
Affinity DataKi:  120nM. Assay description: Displacement of [3H]SCH-23390 from human cloned dopamine D1 receptor
In DepthDetails ArticlePubMed
TargetD(4) dopamine receptor(Homo sapiens (Human))
Korea Research Institute Of Chemical Technology
Curated by ChEMBL
LigandPNGBDBM28583(5-chloro-N-[4-methoxy-3-(piperazin-1-yl)phenyl]-3-...)
Affinity DataKi:  130nM. Assay description: Displacement of [3H]spiperone from human cloned dopamine D4 receptor
In DepthDetails ArticlePubMed
Target5-hydroxytryptamine receptor 1D(Homo sapiens (Human))
Glaxosmithkline
Curated by ChEMBL
LigandPNGBDBM28583(5-chloro-N-[4-methoxy-3-(piperazin-1-yl)phenyl]-3-...)
Affinity DataKi:  251nM. Assay description: The compound was tested for the binding affinity towards human cloned 5-hydroxytryptamine 1D receptor in CHO cells, using [3H]5-HT as radioligand
In DepthDetails ArticlePubMed
Target5-hydroxytryptamine receptor 7(Homo sapiens (Human))
Normandie Univ
Curated by ChEMBL
LigandPNGBDBM28583(5-chloro-N-[4-methoxy-3-(piperazin-1-yl)phenyl]-3-...)
Affinity DataKi:  260nM. Assay description: Displacement of [3H]-LSD from human cloned 5HT7 receptor
In DepthDetails ArticlePubMed
Target5-hydroxytryptamine receptor 1A(Homo sapiens (Human))
Korea Research Institute Of Chemical Technology
Curated by ChEMBL
LigandPNGBDBM28583(5-chloro-N-[4-methoxy-3-(piperazin-1-yl)phenyl]-3-...)
Affinity DataKi:  340nM. Assay description: Displacement of [3H]-8-OH-DPAT from human cloned 5HT1A receptor
In DepthDetails ArticlePubMed
Target5-hydroxytryptamine receptor 1A(Homo sapiens (Human))
Korea Research Institute Of Chemical Technology
Curated by ChEMBL
LigandPNGBDBM28583(5-chloro-N-[4-methoxy-3-(piperazin-1-yl)phenyl]-3-...)
Affinity DataKi:  398nM. Assay description: The compound was tested for the binding affinity towards human cloned 5-hydroxytryptamine 1A receptor in HEK293 cells, using [3H]8-OH-DPAT as radioli...
In DepthDetails ArticlePubMed
TargetD(2) dopamine receptor(Homo sapiens (Human))
Korea Research Institute Of Chemical Technology
Curated by ChEMBL
LigandPNGBDBM28583(5-chloro-N-[4-methoxy-3-(piperazin-1-yl)phenyl]-3-...)
Affinity DataKi:  460nM. Assay description: Displacement of [3H]spiperone from human cloned dopamine D2 receptor
In DepthDetails ArticlePubMed
TargetD(3) dopamine receptor(Homo sapiens (Human))
Glaxosmithkline
Curated by ChEMBL
LigandPNGBDBM28583(5-chloro-N-[4-methoxy-3-(piperazin-1-yl)phenyl]-3-...)
Affinity DataKi:  501nM. Assay description: The compound was tested for the binding affinity towards human cloned Dopamine receptor D3 in CHO cells, using [125I]iodosulpride as radioligand
In DepthDetails ArticlePubMed
Target5-hydroxytryptamine receptor 2C(Homo sapiens (Human))
Korea Research Institute Of Chemical Technology
Curated by ChEMBL
LigandPNGBDBM28583(5-chloro-N-[4-methoxy-3-(piperazin-1-yl)phenyl]-3-...)
Affinity DataKi:  530nM. Assay description: Displacement of [3H]mesulergine from human cloned 5HT2C receptor
In DepthDetails ArticlePubMed
Target5-hydroxytryptamine receptor 2C(Homo sapiens (Human))
Korea Research Institute Of Chemical Technology
Curated by ChEMBL
LigandPNGBDBM28583(5-chloro-N-[4-methoxy-3-(piperazin-1-yl)phenyl]-3-...)
Affinity DataKi:  770nM. Assay description: Displacement of [3H]5-HT from 5-HT2C receptor (unknown origin) expressed in hamster AV12 cells
In DepthDetails ArticlePubMed
Target5-hydroxytryptamine receptor 1B(Homo sapiens (Human))
Glaxosmithkline
Curated by ChEMBL
LigandPNGBDBM28583(5-chloro-N-[4-methoxy-3-(piperazin-1-yl)phenyl]-3-...)
Affinity DataKi:  794nM. Assay description: The compound was tested for the binding affinity towards human cloned 5-hydroxytryptamine 1B receptor in CHO cells, using [3H]5-HT as radioligand
In DepthDetails ArticlePubMed
Target5-hydroxytryptamine receptor 1F(Homo sapiens (Human))
Glaxosmithkline
Curated by ChEMBL
LigandPNGBDBM28583(5-chloro-N-[4-methoxy-3-(piperazin-1-yl)phenyl]-3-...)
Affinity DataKi: <1.00E+3nM. Assay description: The compound was tested for the binding affinity towards human cloned 5-hydroxytryptamine 1F receptor in CHO cells, using [3H]5-HT as radioligand
In DepthDetails ArticlePubMed
TargetD(3) dopamine receptor(Homo sapiens (Human))
Glaxosmithkline
Curated by ChEMBL
LigandPNGBDBM28583(5-chloro-N-[4-methoxy-3-(piperazin-1-yl)phenyl]-3-...)
Affinity DataKi:  1.33E+3nM. Assay description: Displacement of [3H]spiperone from human cloned dopamine D3 receptor
In DepthDetails ArticlePubMed
Target5-hydroxytryptamine receptor 2A(Homo sapiens (Human))
Korea Research Institute Of Chemical Technology
Curated by ChEMBL
LigandPNGBDBM28583(5-chloro-N-[4-methoxy-3-(piperazin-1-yl)phenyl]-3-...)
Affinity DataKi:  1.74E+3nM. Assay description: Displacement of [3H]ketanserin from human cloned 5HT2A receptor
In DepthDetails ArticlePubMed
TargetAlpha-1B adrenergic receptor(Homo sapiens (Human))
Glaxosmithkline
Curated by ChEMBL
LigandPNGBDBM28583(5-chloro-N-[4-methoxy-3-(piperazin-1-yl)phenyl]-3-...)
Affinity DataKi:  2.00E+3nM. Assay description: The compound was tested for the binding affinity towards Alpha-1B adrenergic receptor
In DepthDetails ArticlePubMed
Target5-hydroxytryptamine receptor 2C(Homo sapiens (Human))
Korea Research Institute Of Chemical Technology
Curated by ChEMBL
LigandPNGBDBM28583(5-chloro-N-[4-methoxy-3-(piperazin-1-yl)phenyl]-3-...)
Affinity DataKi:  2.00E+3nM. Assay description: The compound was tested for the binding affinity towards human cloned 5-hydroxytryptamine 2C receptor in HEK293 cells, using [3H]5-mesulergine as rad...
In DepthDetails ArticlePubMed
Target5-hydroxytryptamine receptor 2A(Homo sapiens (Human))
Korea Research Institute Of Chemical Technology
Curated by ChEMBL
LigandPNGBDBM28583(5-chloro-N-[4-methoxy-3-(piperazin-1-yl)phenyl]-3-...)
Affinity DataKi: <2.51E+3nM. Assay description: The compound was tested for the binding affinity towards human cloned 5-hydroxytryptamine 2A receptor in HEK293 cells, using [3H]ketanserin as radiol...
In DepthDetails ArticlePubMed
TargetD(2) dopamine receptor(Homo sapiens (Human))
Korea Research Institute Of Chemical Technology
Curated by ChEMBL
LigandPNGBDBM28583(5-chloro-N-[4-methoxy-3-(piperazin-1-yl)phenyl]-3-...)
Affinity DataKi:  2.51E+3nM. Assay description: The compound was tested for the binding affinity towards human cloned Dopamine receptor D2 in CHO cells, using [125I]iodosulpride as radioligand
In DepthDetails ArticlePubMed
Target5-hydroxytryptamine receptor 7(Homo sapiens (Human))
Normandie Univ
Curated by ChEMBL
LigandPNGBDBM28583(5-chloro-N-[4-methoxy-3-(piperazin-1-yl)phenyl]-3-...)
Affinity DataKi:  3.98E+3nM. Assay description: The compound was tested for the binding affinity towards human cloned 5-hydroxytryptamine 7 receptor in HEK293 cells, using [3H]5-CT as radioligand
In DepthDetails ArticlePubMed
Target5-hydroxytryptamine receptor 4(Homo sapiens (Human))
Glaxosmithkline
Curated by ChEMBL
LigandPNGBDBM28583(5-chloro-N-[4-methoxy-3-(piperazin-1-yl)phenyl]-3-...)
Affinity DataKi:  3.98E+3nM. Assay description: The compound was tested for the binding affinity towards human cloned 5-hydroxytryptamine 4 receptor in HeLa cells, using [3H]LSD as radioligand
In DepthDetails ArticlePubMed
Target5-hydroxytryptamine receptor 2B(Homo sapiens (Human))
Glaxosmithkline
Curated by ChEMBL
LigandPNGBDBM28583(5-chloro-N-[4-methoxy-3-(piperazin-1-yl)phenyl]-3-...)
Affinity DataKi: <3.98E+3nM. Assay description: The compound was tested for the binding affinity towards human cloned 5-hydroxytryptamine 2B receptor in HEK293 cells, using [3H]5-HT as radioligand
In DepthDetails ArticlePubMed
Target5-hydroxytryptamine receptor 1E(Homo sapiens (Human))
Glaxosmithkline
Curated by ChEMBL
LigandPNGBDBM28583(5-chloro-N-[4-methoxy-3-(piperazin-1-yl)phenyl]-3-...)
Affinity DataKi: <1.00E+4nM. Assay description: The compound was tested for the binding affinity towards human cloned 5-hydroxytryptamine 1E receptor in CHO cells, using [3H]5-HT as radioligand
In DepthDetails ArticlePubMed
TargetCytochrome P450 1A2(Homo sapiens (Human))
Smithkline Beecham Pharmaceuticals
Curated by ChEMBL
LigandPNGBDBM28583(5-chloro-N-[4-methoxy-3-(piperazin-1-yl)phenyl]-3-...)
Affinity DataIC50:  6.60E+4nM. Assay description: Inhibition of human cytochrome P450 1A2 activity as caffeine N3 demethylation (500 uM)
In DepthDetails ArticlePubMed
TargetCytochrome P450 2C19(Homo sapiens (Human))
Smithkline Beecham Pharmaceuticals
Curated by ChEMBL
LigandPNGBDBM28583(5-chloro-N-[4-methoxy-3-(piperazin-1-yl)phenyl]-3-...)
Affinity DataIC50:  2.60E+4nM. Assay description: Inhibition of human cytochrome P450 2C19 as S-mephenytoin-4-hydroxylation (100 uM)
In DepthDetails ArticlePubMed
TargetCytochrome P450 3A4(Homo sapiens (Human))
Smithkline Beecham Pharmaceuticals
Curated by ChEMBL
LigandPNGBDBM28583(5-chloro-N-[4-methoxy-3-(piperazin-1-yl)phenyl]-3-...)
Affinity DataIC50:  4.00E+4nM. Assay description: Inhibition of human cytochrome P450 3A4 as total cyclosporin oxidation (1 uM)
In DepthDetails ArticlePubMed
Target5-hydroxytryptamine receptor 6(Homo sapiens (Human))
Jagiellonian University
Curated by ChEMBL
LigandPNGBDBM28583(5-chloro-N-[4-methoxy-3-(piperazin-1-yl)phenyl]-3-...)
Affinity DataIC50:  2nM. Assay description: Inhibition of human recombinant 5HT6 receptor expressed in CHO cells
In DepthDetails ArticlePubMed
TargetCytochrome P450 2D6(Homo sapiens (Human))
Smithkline Beecham Pharmaceuticals
Curated by ChEMBL
LigandPNGBDBM28583(5-chloro-N-[4-methoxy-3-(piperazin-1-yl)phenyl]-3-...)
Affinity DataIC50:  3.20E+4nM. Assay description: Inhibition of human cytochrome P450 2D6 as bufuralol 1''-hydroxylation (10 uM)
In DepthDetails ArticlePubMed
TargetCytochrome P450 2C9(Homo sapiens (Human))
Smithkline Beecham Pharmaceuticals
Curated by ChEMBL
LigandPNGBDBM28583(5-chloro-N-[4-methoxy-3-(piperazin-1-yl)phenyl]-3-...)
Affinity DataIC50: >1.00E+5nM. Assay description: Inhibitory potential of human cytochrome P450 2C9 as tolbutamide methylhydroxylation (100 uM)
In DepthDetails ArticlePubMed