Target
Oxysterols receptor LXR-alpha
Ligand
BDBM304512
Substrate
Meas. Tech.
LXR alpha/beta Radioligand Binding Assay
Ki
27.0±n/a nM
Citation
 Claremon, DADong, CFan, YLeftheris, KLotesta, SDSingh, SBTice, CMZhao, WZheng, YZhuang, L Piperazine derivatives as liver X receptor modulators US Patent  US10144715 Publication Date 12/4/2018 
Target
Name:
Oxysterols receptor LXR-alpha
Synonyms:
LXRA Liver X receptor alpha Liver X receptor alpha (NR1H3) NR1H3 Nuclear orphan receptor LXR-alpha | Nuclear receptor subfamily 1 group H member 3
Type:
Enzyme Catalytic Domain
Mol. Mass.:
50403.85
Organism:
Homo sapiens (Human)
Description:
Q13133
Residue:
447
  
Inhibitor
Name:
BDBM304512
Synonyms:
(R)-2-(2-(4-(4-(hydroxymethyl)-3-(methylsulfonyl)phenyl)-2-isopropylpiperazin-1-yl)-4-(trifluoromethyl)thiazol-5-yl)propan-2-ol US10144715, Compound 28-1
Type:
Small organic molecule
Emp. Form.:
C24H28F3N5O3S2
Mol. Mass.:
555.636
SMILES:
CC(C)[C@@H]1CN(CCN1c1ncc(CO)c(n1)C(F)(F)F)c1ccc(-c2nc(C)cs2)c(c1)S(C)(=O)=O
: