Target
Gag-Pol polyprotein [600-1027,R876K]/[600-1155]
Ligand
BDBM10229
Substrate
poly rC/biotin-dG15
Meas. Tech.
HIV-1 RT Assay
pH
7.4±n/a
Temperature
310.15±n/a K
IC50
11±n/a nM
Citation
 Yoakim, CBonneau, PRDeziel, RDoyon, LDuan, JGuse, ILandry, SMalenfant, ENaud, JOgilvie, WWO'Meara, JAPlante, RSimoneau, BThavonekham, BBos, MCordingley, MG Novel nevirapine-like inhibitors with improved activity against NNRTI-resistant HIV: 8-heteroarylthiomethyldipyridodiazepinone derivatives. Bioorg Med Chem Lett 14:739-42 (2004)  
Target
Name:
Gag-Pol polyprotein [600-1027,R876K]/[600-1155]
Synonyms:
EC: 2.7.7.49 | HIV-1 Reverse Transcriptase
Type:
Protein Complex
Mol. Mass.:
113858
Description:
Components:
This complex has 2 components.
Component 1
Name:
Gag-Pol polyprotein [600-1155]
Synonyms:
HIV-1 Reverse Transcriptase Chain A gag-pol
Type:
Enzyme Subunit
Mol. Mass.:
63928.81
Organism:
Human immunodeficiency virus type 1
Description:
P03366[600-1155]
Residue:
556
  
Component 2
Name:
Gag-Pol polyprotein [600-1027,R876K]
Synonyms:
HIV-1 Reverse Transcriptase Chain B gag-pol
Type:
Enzyme Subunit
Mol. Mass.:
49968.63
Organism:
Human immunodeficiency virus type 1
Description:
P03366[600-1027,R876K]
Residue:
428
  
Inhibitor
Name:
BDBM10229
Synonyms:
5-chloro-2-ethyl-7-methyl-13-{[(3-methylpyridin-4-yl)sulfanyl]methyl}-2,4,9,15-tetraazatricyclo[9.4.0.0^{3,8}]pentadeca-1(11),3,5,7,12,14-hexaen-10-one | 8-heteroarylthiomethyldipyridodiazepinone deriv. 12
Type:
Small organic molecule
Emp. Form.:
C21H20ClN5OS
Mol. Mass.:
425.934
SMILES:
CCN1c2nc(Cl)cc(C)c2NC(=O)c2cc(CSc3ccncc3C)cnc12
:
Substrate
Name:
poly rC/biotin-dG15
Synonyms:
Type:
RNA-DNA duplex
Mol. Mass.:
358.43
Organism:
Description:
The incorporation of Tritium-labeled [3H]dGTP onto a (poly)rC:(biotin)dG template:primer.
Residue:
3
NA