Target
Cyclin-A2/Cyclin-dependent kinase 2
Ligand
BDBM12101
Substrate
Histone H1
Meas. Tech.
Kinase SPA Assay
pH
7.4±n/a
Temperature
295.15±n/a K
IC50
27±n/a nM
Citation
 Nesi, MBorghi, DBrasca, MGFiorentini, FPevarello, P A practical synthesis of the major 3-hydroxy-2-pyrrolidinone metabolite of a potent CDK2/cyclin A inhibitor. Bioorg Med Chem Lett 16:3205-8 (2006)  
Target
Name:
Cyclin-A2/Cyclin-dependent kinase 2
Synonyms:
CDK2-CyclinA CDK2/Cyclin A Cyclin A2/dependent kinase 2 Cyclin-Dependent Kinase 2 (CDK2A)
Type:
Protein Complex
Mol. Mass.:
Description:
Cdk2/Cyclin A kinase was purified from insect cells coinfected with Cyclin A/Cdk2 baculovirus.
Components:
This complex has 2 components.
Component 1
Name:
Cyclin-dependent kinase 2
Synonyms:
CDK2 CDK2_HUMAN Cell division protein kinase 2 Protein cereblon/Cyclin-dependent kinase 2 | p33 protein kinase
Type:
Enzyme Subunit
Mol. Mass.:
33938.17
Organism:
Homo sapiens (Human)
Description:
P24941
Residue:
298
  
Component 2
Name:
Cyclin-A2
Synonyms:
CCN1 CCNA1 CCNA2_HUMAN Cyclin-A
Type:
Enzyme Subunit
Mol. Mass.:
48550.19
Organism:
Homo sapiens (Human)
Description:
P20248
Residue:
432
  
Inhibitor
Name:
BDBM12101
Synonyms:
(2S)-N-(5-cyclopropyl-1H-pyrazol-3-yl)-2-{4-[(3S)-3-hydroxy-2-oxopyrrolidin-1-yl]phenyl}propanamide | PHA-533533 motabolite 2SS
Type:
Small organic molecule
Emp. Form.:
C19H22N4O3
Mol. Mass.:
354.403
SMILES:
C[C@H](C(=O)Nc1cc(n[nH]1)C1CC1)c1ccc(cc1)N1CC[C@H](O)C1=O
:
Substrate
Name:
Histone H1
Synonyms:
Type:
Other Protein Type
Mol. Mass.:
358.43
Organism:
Bos taurus (bovine)
Description:
Residue:
3
NA