Target
Serine/threonine-protein kinase B-raf [410-766,V600E]
Ligand
BDBM16673
Substrate
Serine/threonine-protein kinase RAF and Dual specificity mitogen-activated protein kinase kinase 1 (Raf/MEK)
Meas. Tech.
RAF Kinase Assay
pH
8.2±n/a
Temperature
305.15±n/a K
IC50
38±9 nM
Citation
 Wilhelm, SMCarter, CTang, LWilkie, DMcNabola, ARong, HChen, CZhang, XVincent, PMcHugh, MCao, YShujath, JGawlak, SEveleigh, DRowley, BLiu, LAdnane, LLynch, MAuclair, DTaylor, IGedrich, RVoznesensky, ARiedl, BPost, LEBollag, GTrail, PA BAY 43-9006 exhibits broad spectrum oral antitumor activity and targets the RAF/MEK/ERK pathway and receptor tyrosine kinases involved in tumor progression and angiogenesis. Cancer Res 64:7099-109 (2004)  
Target
Name:
Serine/threonine-protein kinase B-raf [410-766,V600E]
Synonyms:
B-Raf Protein Kinase Mutant (V599E) BRAF BRAF_HUMAN p94 | v-Raf murine sarcoma viral oncogene homolog B1
Type:
COOH-terminal kinase domain
Mol. Mass.:
40318.46
Organism:
Homo sapiens (Human)
Description:
Recombinant baculoviruses expressing V599E B-RAF (residues 409-765) was purified as a fusion protein.
Residue:
357
  
Inhibitor
Name:
BDBM16673
Synonyms:
4-[4-({[4-chloro-3-(trifluoromethyl)phenyl]carbamoyl}amino)phenoxy]-N-methylpyridine-2-carboxamide BAY 43-9006 BAY439006 Hit compound, 8 Sorafenib US10183928, Sorafenib US10227329, Compound Sorafenib US10774070, Compound Sorafenib US11279688, Compound Sorafenib US9029401, Sorafenib US9902709, Comparative example 1 cid_216239
Type:
Small organic molecule
Emp. Form.:
C21H16ClF3N4O3
Mol. Mass.:
464.825
SMILES:
CNC(=O)c1cc(Oc2ccc(NC(=O)Nc3ccc(Cl)c(c3)C(F)(F)F)cc2)ccn1
:
Substrate
Name:
Dual specificity mitogen-activated protein kinase kinase 1
Synonyms:
Dual specificity mitogen-activated protein kinase (MEK) Dual specificity mitogen-activated protein kinase kinase 1 (MEK1) Dual specificity mitogen-activated protein kinase kinase MEK1/2 MAP kinase kinase 1 MAPK/ERK kinase 1 MEK-1 MP2K1_HUMAN PRKMK1 | VHL-MAP2K1/MAP2K2
Type:
Other Protein Type
Mol. Mass.:
43439.03
Organism:
Homo sapiens (Human)
Description:
Full-length human MEK-1 was generated by PCR and purified as a fusion protein from Escherichia coli lysates.
Residue:
393