Target
Mitogen-activated protein kinase 14
Ligand
BDBM20662
Substrate
myelin basic protein
Meas. Tech.
In Vitro Enzyme Inhibition Assay and Cell-based TNFalpha Biosynthesis Inhibition Assay
pH
7.5±n/a
Temperature
295.15±n/a K
IC50
13±n/a nM
EC50
120±n/a nM
Citation
 Hynes, JDyckman, AJLin, SWrobleski, STWu, HGillooly, KMKanner, SBLonial, HLoo, DMcIntyre, KWPitt, SShen, DRShuster, DJYang, XZhang, RBehnia, KZhang, HMarathe, PHDoweyko, AMTokarski, JSSack, JSPokross, MKiefer, SENewitt, JABarrish, JCDodd, JSchieven, GLLeftheris, K Design, synthesis, and anti-inflammatory properties of orally active 4-(phenylamino)-pyrrolo[2,1-f][1,2,4]triazine p38alpha mitogen-activated protein kinase inhibitors. J Med Chem 51:4-16 (2008)  
Target
Name:
Mitogen-activated protein kinase 14
Synonyms:
CSAID-binding protein CSBP1 CSPB1 MAP kinase 14 MAP kinase p38 alpha MAPK14 MK14_HUMAN Mitogen-activated protein kinase p38 alpha Stress-activated protein kinase 2a | p38 MAP kinase alpha/beta
Type:
Serine/threonine-protein kinase
Mol. Mass.:
41286.76
Organism:
Homo sapiens (Human)
Description:
Q16539
Residue:
360
  
Inhibitor
Name:
BDBM20662
Synonyms:
N-methoxy-4-methyl-3-{[5-methyl-6-(2-methylpropanamido)pyrrolo[1,2-a][1,2,4]triazin-4-yl]amino}benzamide | pyrrolo[2,1-f][1,2,4]triazine analogue, 15c
Type:
Small organic molecule
Emp. Form.:
C20H24N6O3
Mol. Mass.:
396.443
SMILES:
CONC(=O)c1ccc(C)c(Nc2ncnn3cc(NC(=O)C(C)C)c(C)c23)c1
:
Substrate
Name:
myelin basic protein
Synonyms:
myelin A1 protein
Type:
Other Protein Type
Mol. Mass.:
4541.90
Organism:
Oryctolagus cuniculus (rabbit)
Description:
Residue:
42