Target
Prothrombin
Ligand
BDBM23873
Substrate
BDBM23924
Meas. Tech.
Determination of Inhibition Constants
Ki
200±n/a nM
Citation
 Steinmetzer, TSchweinitz, AStürzebecher, ADönnecke, DUhland, KSchuster, OSteinmetzer, PMüller, FFriedrich, RThan, MEBode, WStürzebecher, J Secondary amides of sulfonylated 3-amidinophenylalanine. New potent and selective inhibitors of matriptase. J Med Chem 49:4116-26 (2006)  
Target
Name:
Prothrombin
Synonyms:
Activation peptide fragment 1 Coagulation factor II Prothrombin Thrombin Thrombin light chain
Type:
Enzyme
Mol. Mass.:
70502.73
Organism:
Bos taurus (Bovine)
Description:
P00735
Residue:
625
  
Inhibitor
Name:
BDBM23873
Synonyms:
3-amidinophenylalanine deriv., 17 | 3-{3-[4-(2-aminoacetyl)piperazin-1-yl]-3-oxo-2-{[2,4,6-tris(propan-2-yl)benzene]sulfonamido}propyl}benzene-1-carboximidamide
Type:
Small organic molecule
Emp. Form.:
C31H46N6O4S
Mol. Mass.:
598.8
SMILES:
CC(C)c1cc(C(C)C)c(c(c1)C(C)C)S(=O)(=O)NC(Cc1cccc(c1)C(N)=N)C(=O)N1CCN(CC1)C(=O)CN
:
Substrate
Name:
BDBM23924
Synonyms:
MeSO2-D-hexahydrotyrosyl-Gly-Arg-p-nitroanilide | MeSO2-D-hexahydrotyrosyl-Gly-Arg-pNA
Type:
Emp. Form.:
Mol. Mass.:
SMILES:
: