Target
Phosphatidylinositol 4,5-bisphosphate 3-kinase catalytic subunit gamma isoform
Ligand
BDBM25112
Substrate
BDBM15235
Meas. Tech.
Determination of PI3K Activity
IC50
1300±n/a nM
Citation
 Palanki, MSDneprovskaia, EDoukas, JFine, RMHood, JKang, XLohse, DMartin, MNoronha, GSoll, RMWrasidlo, WYee, SZhu, H Discovery of 3,3'-(2,4-diaminopteridine-6,7-diyl)diphenol as an isozyme-selective inhibitor of PI3K for the treatment of ischemia reperfusion injury associated with myocardial infarction. J Med Chem 50:4279-94 (2007)  
Target
Name:
Phosphatidylinositol 4,5-bisphosphate 3-kinase catalytic subunit gamma isoform
Synonyms:
PI3-kinase p110 subunit gamma PI3Kgamma PK3CG_HUMAN Phosphatidylinositol 4,5-bisphosphate 3-kinase (PI3K) Phosphatidylinositol 4,5-bisphosphate 3-kinase catalytic subunit gamma (PI3Kgamma) Phosphatidylinositol 4,5-bisphosphate 3-kinase catalytic subunit gamma isoform (PI3K) Phosphatidylinositol-4,5-bisphosphate 3-kinase catalytic subunit gamma isoform Phosphoinositide 3-kinases gamma (PI3K gamma) p120-PI3K
Type:
Enzyme Subunit
Mol. Mass.:
126470.30
Organism:
Homo sapiens (Human)
Description:
P48736
Residue:
1102
  
Inhibitor
Name:
BDBM25112
Synonyms:
4-(4-aminopteridin-6-yl)benzene-1,2-diol | aminopteridine derivative, 34
Type:
Small organic molecule
Emp. Form.:
C12H9N5O2
Mol. Mass.:
255.2322
SMILES:
Nc1ncnc2ncc(nc12)-c1ccc(O)c(O)c1
:
Substrate
Name:
BDBM15235
Synonyms:
L-alpha-Phosphatidylinositol 4,5-bisphosphate PtdInsP2
Type:
Small organic molecule
Emp. Form.:
C47H80O19P3
Mol. Mass.:
1042.0507
SMILES:
CCCCCCCCCCCCCCCCCC(=O)OCC(COP([O-])(=O)O[C@@H]1[C@H](O)[C@H](O)[C@@H](OP([O-])([O-])=O)[C@H](OP([O-])([O-])=O)[C@H]1O)OC(=O)CCC\C=C/C\C=C/C\C=C/C\C=C/CCCCC
: