Target
Nociceptin receptor
Ligand
BDBM29987
Substrate
BDBM29961
Meas. Tech.
In Vitro Binding Assay (IC50) and In Vitro Agonism/Antagonism Measurements (EC50/IC50)
pH
7.4±n/a
Temperature
310.15±n/a K
IC50
2.4±n/a nM
EC50
0.72±n/a nM
Citation
 Kobayashi, KUchiyama, MTakahashi, HKawamoto, HIto, SYoshizumi, TNakashima, HKato, TShimizu, AYamamoto, IAsai, MMiyazoe, HOhno, AHirayama, MOzaki, STani, TIshii, YTanaka, TMochidome, TTadano, KFukuroda, TOhta, HOkamoto, O 2-Cyclohexylcarbonylbenzimidazoles as potent, orally available and brain-penetrable opioid receptor-like 1 (ORL1) antagonists. Bioorg Med Chem Lett 19:3096-9 (2009)  
Target
Name:
Nociceptin receptor
Synonyms:
KOR-3 Mu-type opioid receptor (Mu) Nociceptin Receptor (ORL1 Receptor) Nociceptin receptor (ORL-1) Nociceptin/Orphanin FQ, NOP receptor OPIATE ORL-1 OPRL1 protein ORL1 Opioid receptor like-1 Orphanin FQ receptor (ORL1) | P41146
Type:
G Protein-Coupled Receptor (GPCR)
Mol. Mass.:
40702.87
Organism:
Homo sapiens (Human)
Description:
P41146
Residue:
370
  
Inhibitor
Name:
BDBM29987
Synonyms:
benzimidazole analogue, 7e | benzimidazole derivative, 1
Type:
Small organic molecule
Emp. Form.:
C22H32ClN5O2S
Mol. Mass.:
466.04
SMILES:
CCN1CCN(CC1)c1cc2[nH]c(S[C@@]3(C)CC[C@@H](CC3)NC(=O)OC)nc2cc1Cl
:
Substrate
Name:
BDBM29961
Synonyms:
[125I]Tyr14-NC/OFQ | [125I]Tyr14-Nociceptin
Type:
radiolabeled substrate
Emp. Form.:
Mol. Mass.:
SMILES:
: