Target
D-aspartate oxidase
Ligand
BDBM31147
Substrate
BDBM31174
Meas. Tech.
DAAO in Vitro Activity Assay
IC50
>19500±n/a nM
Citation
 Duplantier, AJBecker, SLBohanon, MJBorzilleri, KAChrunyk, BADowns, JTHu, LYEl-Kattan, AJames, LCLiu, SLu, JMaklad, NMansour, MNMente, SPiotrowski, MASakya, SMSheehan, SSteyn, SJStrick, CAWilliams, VAZhang, L Discovery, SAR, and pharmacokinetics of a novel 3-hydroxyquinolin-2(1H)-one series of potent D-amino acid oxidase (DAAO) inhibitors. J Med Chem 52:3576-85 (2009)  
Target
Name:
D-aspartate oxidase
Synonyms:
D-Aspartate Oxidase (DDO) DDO | OXDD_HUMAN
Type:
Oxidoreductase
Mol. Mass.:
37543.06
Organism:
Homo sapiens (Human)
Description:
Recombinant human DDO expressed and purified from sf9 insect cells, was used in enzyme assays.
Residue:
341
  
Inhibitor
Name:
BDBM31147
Synonyms:
4H-furo[3,2-b]pyrrole-5-carboxylic acid CHEMBL492591
Type:
Small organic molecule
Emp. Form.:
C7H5NO3
Mol. Mass.:
151.1195
SMILES:
OC(=O)c1cc2occc2[nH]1
:
Substrate
Name:
BDBM31174
Synonyms:
CHEMBL29757 D-Aspartic Acid
Type:
Amino Acid
Emp. Form.:
C4H7NO4
Mol. Mass.:
133.1027
SMILES:
N[C@H](CC(O)=O)C(O)=O
: