Target
D(2) dopamine receptor
Ligand
BDBM50000070
Substrate
Meas. Tech.
ChEBML_62074
Ki
3006±n/a nM
Citation
 de Costa, BRRadesca, LDi Paolo, LBowen, WD Synthesis, characterization, and biological evaluation of a novel class of N-(arylethyl)-N-alkyl-2-(1-pyrrolidinyl)ethylamines: structural requirements and binding affinity at the sigma receptor. J Med Chem 35:38-47 (1992)  
Target
Name:
D(2) dopamine receptor
Synonyms:
DOPAMINE D2 DOPAMINE D2 Short Dopamine D2 receptor Drd2
Type:
G Protein-Coupled Receptor (GPCR)
Mol. Mass.:
50931.60
Organism:
Rattus norvegicus (rat)
Description:
P61169
Residue:
444
  
Inhibitor
Name:
BDBM50000070
Synonyms:
CHEMBL143178 | N-[2-(3,4-Dichloro-phenyl)-ethyl]-N',N'-diethyl-N-methyl-ethane-1,2-diamine
Type:
Small organic molecule
Emp. Form.:
C15H24Cl2N2
Mol. Mass.:
303.27
SMILES:
CCN(CC)CCN(C)CCc1ccc(Cl)c(Cl)c1
: