Target
D(2) dopamine receptor
Ligand
BDBM50000074
Substrate
Meas. Tech.
ChEBML_62074
Ki
6497±n/a nM
Citation
 de Costa, BRRadesca, LDi Paolo, LBowen, WD Synthesis, characterization, and biological evaluation of a novel class of N-(arylethyl)-N-alkyl-2-(1-pyrrolidinyl)ethylamines: structural requirements and binding affinity at the sigma receptor. J Med Chem 35:38-47 (1992)  
Target
Name:
D(2) dopamine receptor
Synonyms:
DOPAMINE D2 DOPAMINE D2 Short Dopamine D2 receptor Drd2
Type:
G Protein-Coupled Receptor (GPCR)
Mol. Mass.:
50931.60
Organism:
Rattus norvegicus (rat)
Description:
P61169
Residue:
444
  
Inhibitor
Name:
BDBM50000074
Synonyms:
CHEMBL142596 | [2-(3-Chloro-phenyl)-ethyl]-methyl-(2-pyrrolidin-1-yl-ethyl)-amine
Type:
Small organic molecule
Emp. Form.:
C15H23ClN2
Mol. Mass.:
266.81
SMILES:
CN(CCN1CCCC1)CCc1cccc(Cl)c1
: