Target
Kappa-type opioid receptor
Ligand
BDBM50000266
Substrate
Meas. Tech.
ChEBML_145682
IC50
>10000±n/a nM
Citation
 Scopes, DIHayes, NFBays, DEBelton, DBrain, JBrown, DSJudd, DBMcElroy, ABMeerholz, CANaylor, A New kappa-receptor agonists based upon a 2-[(alkylamino)methyl]piperidine nucleus. J Med Chem 35:490-501 (1992)  
Target
Name:
Kappa-type opioid receptor
Synonyms:
K-OR-1 Kappa-opioid receptor (KOR) Kappa-type opioid receptor (KOR) OPIATE Kappa OPRK1 kappa opioid receptor (KOR)
Type:
G Protein-Coupled Receptor (GPCR)
Mol. Mass.:
42648.76
Organism:
Homo sapiens (Human)
Description:
P41145
Residue:
380
  
Inhibitor
Name:
BDBM50000266
Synonyms:
1-[2-(3,4-Dichloro-phenyl)-acetyl]-6-pyrrolidin-1-ylmethyl-piperidine-2-carboxylic acid methyl ester | CHEMBL148892
Type:
Small organic molecule
Emp. Form.:
C20H26Cl2N2O3
Mol. Mass.:
413.338
SMILES:
COC(=O)[C@H]1CCC[C@@H](CN2CCCC2)N1C(=O)Cc1ccc(Cl)c(Cl)c1
: