Target
Kappa-type opioid receptor
Ligand
BDBM50001848
Substrate
Meas. Tech.
ChEBML_145373
IC50
330±n/a nM
Citation
 Chandrakumar, NSYonan, PKStapelfeld, ASavage, MRorbacher, EContreras, PCHammond, D Preparation and opioid activity of analogues of the analgesic dipeptide 2,6-dimethyl-L-tyrosyl-N-(3-phenylpropyl)-D-alaninamide. J Med Chem 35:223-33 (1992)  
Target
Name:
Kappa-type opioid receptor
Synonyms:
KOR-1 OPIATE Kappa Opioid receptor Ror-d
Type:
G Protein-Coupled Receptor (GPCR)
Mol. Mass.:
42692.90
Organism:
Rattus norvegicus (rat)
Description:
P34975
Residue:
380
  
Inhibitor
Name:
BDBM50001848
Synonyms:
2-Amino-3-(4-hydroxy-2,6-dimethyl-phenyl)-N-[1-methyl-2-(3-phenyl-propylamino)-ethyl]-propionamide | CHEMBL76527
Type:
Small organic molecule
Emp. Form.:
C23H33N3O2
Mol. Mass.:
383.527
SMILES:
C[C@H](CNCCCc1ccccc1)NC(=O)C(N)Cc1c(C)cc(O)cc1C
: