Target
Acetyl-CoA carboxylase 2
Ligand
BDBM50247155
Substrate
Meas. Tech.
ChEMBL_1677381 (CHEMBL4027524)
IC50
5700±n/a nM
Citation
 Mizojiri, RAsano, MTomita, DBanno, HNii, NSasaki, MSumi, HSatoh, YYamamoto, YMoriya, TSatomi, YMaezaki, H Discovery of Novel Selective Acetyl-CoA Carboxylase (ACC) 1 Inhibitors. J Med Chem 61:1098-1117 (2018)  
Target
Name:
Acetyl-CoA carboxylase 2
Synonyms:
ACACB ACC-beta ACCB Acetyl-CoA carboxylase 2 Acetyl-CoA carboxylase 2 (ACC2)
Type:
Protein
Mol. Mass.:
276535.21
Organism:
Homo sapiens (Human)
Description:
O00763
Residue:
2458
  
Inhibitor
Name:
BDBM50247155
Synonyms:
CHEMBL4064059
Type:
Small organic molecule
Emp. Form.:
C24H26N2O5
Mol. Mass.:
422.4736
SMILES:
C[C@H](COc1cnc(o1)-c1ccc(Oc2cccc(OCC3CC3)c2)cc1)NC(C)=O
: