Target
Bifunctional purine biosynthesis protein ATIC
Ligand
BDBM50003896
Substrate
Meas. Tech.
ChEBML_28431
IC50
130000±n/a nM
Citation
 Bigham, ECHodson, SJMallory, WRWilson, DDuch, DSSmith, GKFerone, R Synthesis and biological activity of open-chain analogues of 5,6,7,8-tetrahydrofolic acid--potential antitumor agents. J Med Chem 35:1399-410 (1992)  
Target
Name:
Bifunctional purine biosynthesis protein ATIC
Synonyms:
5-aminoimidazole-4-carboxamide ribonucleotide formyltransferase AICAR Tfase ATIC Bifunctional purine biosynthesis protein PURH IMP cyclohydrolase Inosinicase PURH Thymidylate synthase/GAR transformylase/AICAR transformylase
Type:
Protein
Mol. Mass.:
64616.62
Organism:
Homo sapiens (Human)
Description:
P31939
Residue:
592
  
Inhibitor
Name:
BDBM50003896
Synonyms:
(DDATHF) 5,10-Dideazatetrahydrofolic acid2-{4-[2-(2-Amino-4-oxo-3,4,5,6,7,8-hexahydro-pyrido[2,3-d]pyrimidin-6-yl)-ethyl]-benzoylamino}-pentanedioic acid 2-{4-[(2,4-Diamino-pteridin-6-ylmethyl)-methyl-amino]-benzoylamino}-pentanedioic acid 2-{4-[2-(2-Amino-4-oxo-3,4,5,6,7,8-hexahydro-pyrido[2,3-d]pyrimidin-6-yl)-ethyl]-benzoylamino}-pentanedioic acid | CHEMBL170101
Type:
Small organic molecule
Emp. Form.:
C21H25N5O6
Mol. Mass.:
443.4531
SMILES:
Nc1nc2NCC(CCc3ccc(cc3)C(=O)NC(CCC(O)=O)C(O)=O)Cc2c(=O)[nH]1
: