Target
Atypical chemokine receptor 3
Ligand
BDBM50250386
Substrate
Meas. Tech.
ChEBML_1681651
Ki
30±n/a nM
Citation
 Boehm, MBeaumont, KJones, RKalgutkar, ASZhang, LAtkinson, KBai, GBrown, JAEng, HGoetz, GHHolder, BRKhunte, BLazzaro, SLimberakis, CRyu, SShapiro, MJTylaska, LYan, JTurner, RLeung, SSFRamaseshan, MPrice, DALiras, SJacobson, MPEarp, DJLokey, RSMathiowetz, AMMenhaji-Klotz, E Discovery of Potent and Orally Bioavailable Macrocyclic Peptide-Peptoid Hybrid CXCR7 Modulators. J Med Chem 60:9653-9663 (2017)  
Target
Name:
Atypical chemokine receptor 3
Synonyms:
ACKR3 C-X-C chemokine receptor type 7 CMKOR1 CXCR-7 Chemokine orphan receptor 1 G-protein coupled receptor RDC1 homolog RDC-1 | RDC1
Type:
Enzyme
Mol. Mass.:
41498.84
Organism:
Homo sapiens (Human)
Description:
P25106
Residue:
362
  
Inhibitor
Name:
BDBM50250386
Synonyms:
CHEMBL4095028
Type:
Small organic molecule
Emp. Form.:
C53H56N10O6
Mol. Mass.:
929.0751
SMILES:
O=C1CN(CCCc2ccccc2)C(=O)[C@H]2CCCN2C(=O)[C@H](Cc2c[nH]cn2)NC(=O)[C@H](Cc2c[nH]c3ccccc23)NC(=O)[C@@H](Cc2ccccc2)NC(=O)[C@H](Cc2c[nH]c3ccccc23)N1
: