Target
Gag-Pol polyprotein [489-587]
Ligand
BDBM50006826
Substrate
Meas. Tech.
ChEMBL_159304 (CHEMBL769357)
IC50
1100±n/a nM
Citation
 Tucker, TJLumma, WCPayne, LSWai, JMde Solms, SJGiuliani, EADarke, PLHeimbach, JCZugay, JASchleif, WA A series of potent HIV-1 protease inhibitors containing a hydroxyethyl secondary amine transition state isostere: synthesis, enzyme inhibition, and antiviral activity. J Med Chem 35:2525-33 (1992)  
Target
Name:
Gag-Pol polyprotein [489-587]
Synonyms:
Human immunodeficiency virus type 1 protease Pol polyprotein | gag-pol
Type:
Enzyme Subunit
Mol. Mass.:
10781.16
Organism:
Human immunodeficiency virus type 1
Description:
P04585[489-587]
Residue:
99
  
Inhibitor
Name:
BDBM50006826
Synonyms:
2-Amino-N*1*-{1-benzyl-2-hydroxy-3-[1-(2-hydroxy-indan-1-ylcarbamoyl)-2-phenyl-ethylamino]-propyl}-succinamide (0.80 hydrate) | CHEMBL309402
Type:
Small organic molecule
Emp. Form.:
C32H39N5O5
Mol. Mass.:
573.6826
SMILES:
NC(CC(N)=O)C(=O)N[C@@H](Cc1ccccc1)[C@H](O)CN[C@@H](Cc1ccccc1)C(=O)NC1[C@H](O)Cc2ccccc12
: