Target
Platelet-activating factor receptor
Ligand
BDBM50007469
Substrate
Meas. Tech.
ChEBML_86450
IC50
28000±n/a nM
Citation
 Piwinski, JJWong, JKGreen, MJGanguly, AKBillah, MMWest, REKreutner, W Dual antagonists of platelet activating factor and histamine. Identification of structural requirements for dual activity of N-Acyl-4-(5,6-dihydro-11H-benzo [5,6]cyclohepta-[1,2-b]pyridin-11-ylidene)piperidines. J Med Chem 34:457-61 (1991)  
Target
Name:
Platelet-activating factor receptor
Synonyms:
PAF Platelet activating factor PAFR PTAFR_HUMAN Platelet-activating factor receptor
Type:
Enzyme Catalytic Domain
Mol. Mass.:
39219.60
Organism:
Homo sapiens (Human)
Description:
PAF Platelet activating factor PTAFR HUMAN::P25105
Residue:
342
  
Inhibitor
Name:
BDBM50007469
Synonyms:
1-{4-[(4-Chloro-phenyl)-pyridin-2-yl-methylene]-piperidin-1-yl}-ethanone | CHEMBL140919
Type:
Small organic molecule
Emp. Form.:
C19H19ClN2O
Mol. Mass.:
326.82
SMILES:
[#6]-[#6](=O)-[#7]-1-[#6]-[#6]\[#6](-[#6]-[#6]-1)=[#6](/c1ccc(Cl)cc1)-c1ccccn1
: