Target
Lysyl oxidase homolog 2
Ligand
BDBM50266786
Substrate
Meas. Tech.
ChEBML_1701363
IC50
100±n/a nM
Citation
 Rowbottom, MWBain, GCalderon, ILasof, TLonergan, DLai, AHuang, FDarlington, JProdanovich, PSantini, AMKing, CDGoulet, LShannon, KEMa, GLNguyen, KMacKenna, DAEvans, JFHutchinson, JH Identification of 4-(Aminomethyl)-6-(trifluoromethyl)-2-(phenoxy)pyridine Derivatives as Potent, Selective, and Orally Efficacious Inhibitors of the Copper-Dependent Amine Oxidase, Lysyl Oxidase-Like 2 (LOXL2). J Med Chem 60:4403-4423 (2017)  
Target
Name:
Lysyl oxidase homolog 2
Synonyms:
1.4.3.13 Loxl2 Lysyl oxidase-like protein 2
Type:
PROTEIN
Mol. Mass.:
87003.17
Organism:
Mus musculus
Description:
ChEMBL_117436
Residue:
776
  
Inhibitor
Name:
BDBM50266786
Synonyms:
CHEMBL4063337
Type:
Small organic molecule
Emp. Form.:
C17H19ClFN3O3
Mol. Mass.:
367.802
SMILES:
Cl.NCc1ccnc(Oc2cccc(c2)C(=O)N2C[C@@H](O)[C@H](F)C2)c1
: