Target
Aldo-keto reductase family 1 member B1
Ligand
BDBM16312
Substrate
Meas. Tech.
ChEBML_31770
IC50
20000±n/a nM
Citation
 Sarges, RBordner, JDominy, BWPeterson, MJWhipple, EB Synthesis, absolute configuration, and conformation of the aldose reductase inhibitor sorbinil. J Med Chem 28:1716-20 (1985)  
Target
Name:
Aldo-keto reductase family 1 member B1
Synonyms:
AKR1B1 ALDR_HUMAN AR Aldose Reductase (ALR2) Aldose reductase (AR)
Type:
Protein
Mol. Mass.:
35855.50
Organism:
Homo sapiens (Human)
Description:
P15121. 4LAU; 2IKI; 4LB4; 2FZD; 2FZ8; 1US0
Residue:
316
  
Inhibitor
Name:
BDBM16312
Synonyms:
(4S)-6-fluoro-2,3-dihydrospiro[1-benzopyran-4,4'-imidazolidine]-2',5'-dione Sorbinil
Type:
Small organic molecule
Emp. Form.:
C11H9FN2O3
Mol. Mass.:
236.1992
SMILES:
Fc1ccc2OCC[C@]3(NC(=O)NC3=O)c2c1
: