Target
Replicase polyprotein 1ab
Ligand
BDBM50071055
Substrate
Meas. Tech.
ChEMBL_614784 (CHEMBL1113303)
IC50
9900±n/a nM
Citation
 Ryu, YBPark, SJKim, YMLee, JYSeo, WDChang, JSPark, KHRho, MCLee, WS SARS-CoV 3CLpro inhibitory effects of quinone-methide triterpenes from Tripterygium regelii. Bioorg Med Chem Lett 20:1873-6 (2010)  
Target
Name:
Replicase polyprotein 1ab
Synonyms:
3C-like proteinase 3C-like proteinase (SARS-CoV 3Cpro) 3CLp GFL Guanine-N7 methyltransferase Helicase Leader protein Non-structural protein 10 Non-structural protein 3 Non-structural protein 6 Non-structural protein 8 ORF1ab polyprotein PL2-PRO Pol R1AB_SARS RdRp SARS coronavirus main proteinase nsp1 nsp12 nsp14 nsp16 nsp3 nsp5 nsp7 nsp9 pp1ab | rep
Type:
Protein
Mol. Mass.:
790250.81
Organism:
Human SARS coronavirus (SARS-CoV) (Severe acute respiratory syndrome coronavirus)
Description:
P0C6X7
Residue:
7073
  
Inhibitor
Name:
BDBM50071055
Synonyms:
(6bS,8aS,11R,12aR,12bS,14aR)-3-Hydroxy-4,6b,8a,11,12b,14a-hexamethyl-7,8,8a,11,12,12a,12b,13,14,14a-decahydro-6bH,9H-picene-2,10-dione TINGENONE
Type:
Small organic molecule
Emp. Form.:
C28H36O3
Mol. Mass.:
420.5836
SMILES:
C[C@@H]1C[C@@H]2[C@@](C)(CC[C@]3(C)C4=CC=c5c(cc(O)c(O)c5=C)[C@]4(C)CC[C@@]23C)CC1=O
: