Target
Replicase polyprotein 1ab
Ligand
BDBM50442901
Substrate
Meas. Tech.
ChEMBL_685004 (CHEMBL1286522)
IC50
189100±n/a nM
Citation
 Ryu, YBJeong, HJKim, JHKim, YMPark, JYKim, DNguyen, TTPark, SJChang, JSPark, KHRho, MCLee, WS Biflavonoids from Torreya nucifera displaying SARS-CoV 3CL(pro) inhibition. Bioorg Med Chem 18:7940-7 (2010)  
Target
Name:
Replicase polyprotein 1ab
Synonyms:
3C-like proteinase 3C-like proteinase (SARS-CoV 3Cpro) 3CLp GFL Guanine-N7 methyltransferase Helicase Leader protein Non-structural protein 10 Non-structural protein 3 Non-structural protein 6 Non-structural protein 8 ORF1ab polyprotein PL2-PRO Pol R1AB_SARS RdRp SARS coronavirus main proteinase nsp1 nsp12 nsp14 nsp16 nsp3 nsp5 nsp7 nsp9 pp1ab | rep
Type:
Protein
Mol. Mass.:
790250.81
Organism:
Human SARS coronavirus (SARS-CoV) (Severe acute respiratory syndrome coronavirus)
Description:
P0C6X7
Residue:
7073
  
Inhibitor
Name:
BDBM50442901
Synonyms:
Abietic Acid | acs.jmedchem.1c00409_ST.770
Type:
Small organic molecule
Emp. Form.:
C20H30O2
Mol. Mass.:
302.451
SMILES:
[H][C@]12CCC(=CC1=CC[C@@]1([H])[C@@](C)(CCC[C@]21C)C(O)=O)C(C)C
: