Target
Phenylethanolamine N-methyltransferase
Ligand
BDBM50029102
Substrate
Meas. Tech.
ChEMBL_152588 (CHEMBL759766)
Ki
29±n/a nM
Citation
 Bondinell, WEChapin, FWGirard, GRKaiser, CKrog, AJPavloff, AMSchwartz, MSSilvestri, JSVaidya, PDLam, BLWellman, GRPendleton, RG Inhibitors of phenylethanolamine N-methyltransferase and epinephrine biosynthesis. 1. Chloro-substituted 1,2,3,4-tetrahydroisoquinolines. J Med Chem 23:506-11 (1980)  
Target
Name:
Phenylethanolamine N-methyltransferase
Synonyms:
Noradrenaline N-methyltransferase PNMT PNMTase | Phenylethanolamine N-Methyltransferase (PNMT)
Type:
Enzyme
Mol. Mass.:
30852.66
Organism:
Homo sapiens (Human)
Description:
Residue:
282
  
Inhibitor
Name:
BDBM50029102
Synonyms:
7-Chloro-1,2,3,4-tetrahydro-isoquinoline | CHEMBL149023
Type:
Small organic molecule
Emp. Form.:
C9H10ClN
Mol. Mass.:
167.635
SMILES:
Clc1ccc2CCNCc2c1
: