Target
Cholecystokinin receptor type A
Ligand
BDBM50041643
Substrate
Meas. Tech.
ChEMBL_49582 (CHEMBL661235)
IC50
750±n/a nM
Citation
 Elliott, RLKopecka, HTufano, MDShue, YKGauri, AJLin, CWBianchi, BRMiller, TRWitte, DGStashko, MA Novel Asp32-replacement tetrapeptide analogues as potent and selective CCK-A agonists. J Med Chem 37:1562-8 (1994)  
Target
Name:
Cholecystokinin receptor type A
Synonyms:
CCK-A receptor CCK1-R CCKAR_CAVPO Cholecystokinin receptor type A | Cholecystokinin-1 receptor
Type:
Mol. Mass.:
48229.77
Organism:
Cavia porcellus
Description:
Residue:
430
  
Inhibitor
Name:
BDBM50041643
Synonyms:
CHEMBL285772 | [1-[(S)-1-[4-(1-Carbamoyl-2-phenyl-ethyl)-5-oxo-[1,4]diazepane-1-carbonyl]-5-(3-o-tolyl-ureido)-pentylcarbamoyl]-2-(1H-indol-3-yl)-ethyl]-carbamic acid tert-butyl ester
Type:
Small organic molecule
Emp. Form.:
C44H56N8O7
Mol. Mass.:
808.9648
SMILES:
Cc1ccccc1NC(=O)NCCCC[C@H](NC(=O)C(Cc1c[nH]c2ccccc12)NC(=O)OC(C)(C)C)C(=O)N1CCN(C(Cc2ccccc2)C(N)=O)C(=O)CC1
: