Target
Substance-K receptor
Ligand
BDBM50052523
Substrate
Meas. Tech.
ChEMBL_209225 (CHEMBL814853)
EC50
>200000±n/a nM
Citation
 Byk, GHalle, DZeltser, IBitan, GSelinger, ZGilon, C Synthesis and biological activity of NK-1 selective, N-backbone cyclic analogs of the C-terminal hexapeptide of substance P. J Med Chem 39:3174-8 (1996)  
Target
Name:
Substance-K receptor
Synonyms:
NK-2 receptor NK2R_RAT Neurokinin A receptor SKR Tac2r Tacr2
Type:
Enzyme Catalytic Domain
Mol. Mass.:
43868.63
Organism:
Rattus norvegicus (Rat)
Description:
Neurokinin NK2 TACR2 Murine::P16610
Residue:
390
  
Inhibitor
Name:
BDBM50052523
Synonyms:
(R)-1-{(S)-2-[(S)-2-((S)-2-Acetylamino-5-guanidino-pentanoylamino)-3-phenyl-propionylamino]-3-phenyl-propionyl}-pyrrolidine-2-carboxylic acid [(S)-1-((S)-1-carbamoyl-3-methylsulfanyl-propylcarbamoyl)-3-methyl-butyl]-amide | CHEMBL422779
Type:
Small organic molecule
Emp. Form.:
C42H62N10O7S
Mol. Mass.:
851.069
SMILES:
CSCC[C@H](NC(=O)[C@H](CC(C)C)NC(=O)[C@H]1CCCN1C(=O)[C@H](Cc1ccccc1)NC(=O)[C@H](Cc1ccccc1)NC(=O)[C@H](CCCNC(N)=N)NC(C)=O)C(N)=O
: