Target
Protein kinase C alpha type
Ligand
BDBM50054421
Substrate
Meas. Tech.
ChEMBL_162399 (CHEMBL769346)
IC50
>100000±n/a nM
Citation
 Pereira, ERBelin, LSancelme, MPrudhomme, MOllier, MRapp, MSevère, DRiou, JFFabbro, DMeyer, T Structure-activity relationships in a series of substituted indolocarbazoles: topoisomerase I and protein kinase C inhibition and antitumoral and antimicrobial properties. J Med Chem 39:4471-7 (1996)  
Target
Name:
Protein kinase C alpha type
Synonyms:
KPCA_HUMAN PKC alpha and beta-2 PKC-alpha PRKACA Protein Kinase C- alpha Protein kinase C alpha (PKCa) Protein kinase C alpha type (PRKCA) RAF proto-oncogene serine/threonine-protein kinase
Type:
Enzyme
Mol. Mass.:
76755.65
Organism:
Homo sapiens (Human)
Description:
The recombinant human PKC enzymes were produced using a baculovirus expression system in SF9 cells
Residue:
672
  
Inhibitor
Name:
BDBM50054421
Synonyms:
1,11-dichloro-6,7,12,13-tetrahydro-5H-indolo[2,3-a]pyrrolo[3,4-c]carbazole-5,7-dione | CHEMBL139517
Type:
Small organic molecule
Emp. Form.:
C20H9Cl2N3O2
Mol. Mass.:
394.21
SMILES:
Clc1cccc2c1[nH]c1c3[nH]c4c(Cl)cccc4c3c3C(=O)NC(=O)c3c21
: