Target
Chymotrypsinogen A
Ligand
BDBM50061509
Substrate
Meas. Tech.
ChEMBL_33820 (CHEMBL646850)
IC50
>300000±n/a nM
Citation
 Ogilvie, WBailey, MPoupart, MAAbraham, ABhavsar, ABonneau, PBordeleau, JBousquet, YChabot, CDuceppe, JSFazal, GGoulet, SGrand-Maître, CGuse, IHalmos, TLavallée, PLeach, MMalenfant, EO'Meara, JPlante, RPlouffe, CPoirier, MSoucy, FYoakim, CDéziel, R Peptidomimetic inhibitors of the human cytomegalovirus protease. J Med Chem 40:4113-35 (1998)  
Target
Name:
Chymotrypsinogen A
Synonyms:
Alpha-chymotrypsin Chymotrypsin A Chymotrypsin A chain B Chymotrypsinogen A | alpha-Chymotrypsin (α-Chymotrypsin)
Type:
Serine protease
Mol. Mass.:
25670.88
Organism:
Bos taurus (bovine)
Description:
Residue:
245
  
Inhibitor
Name:
BDBM50061509
Synonyms:
(S)-2-[(S)-2-(3,3-Dimethyl-butyrylamino)-3,3-dimethyl-butyrylamino]-N*4*,N*4*-dimethyl-N*1*-[1-methyl-2-(5-methyl-benzooxazol-2-yl)-2-oxo-ethyl]-succinamide | CHEMBL133854
Type:
Small organic molecule
Emp. Form.:
C29H43N5O6
Mol. Mass.:
557.6816
SMILES:
CC(NC(=O)[C@H](CC(=O)N(C)C)NC(=O)[C@@H](NC(=O)CC(C)(C)C)C(C)(C)C)C(=O)c1nc2cc(C)ccc2o1
: