Target
Genome polyprotein
Ligand
BDBM50075611
Substrate
Meas. Tech.
ChEMBL_161099 (CHEMBL771560)
EC50
20±n/a nM
Citation
 Dragovich, PSPrins, TJZhou, RWebber, SEMarakovits, JTFuhrman, SAPatick, AKMatthews, DALee, CAFord, CEBurke, BJRejto, PAHendrickson, TFTuntland, TBrown, ELMeador, JWFerre, RAHarr, JEKosa, MBWorland, ST Structure-based design, synthesis, and biological evaluation of irreversible human rhinovirus 3C protease inhibitors. 4. Incorporation of P1 lactam moieties as L-glutamine replacements. J Med Chem 42:1213-24 (1999)  
Target
Name:
Genome polyprotein
Synonyms:
Human rhinovirus A protease | Human rhinovirus B 3A protease
Type:
PROTEIN
Mol. Mass.:
44361.04
Organism:
Human rhinovirus B
Description:
ChEMBL_158953
Residue:
401
  
Inhibitor
Name:
BDBM50075611
Synonyms:
(E)-(S)-4-((S)-3-(4-Fluoro-phenyl)-2-{(S)-3-methyl-2-[(5-methyl-isoxazole-3-carbonyl)-amino]-butyrylamino}-propionylamino)-5-((S)-2-oxo-piperidin-3-yl)-pent-2-enoic acid ethyl ester | CHEMBL20260
Type:
Small organic molecule
Emp. Form.:
C31H40FN5O7
Mol. Mass.:
613.677
SMILES:
CCOC(=O)\C=C\[C@H](C[C@@H]1CCCNC1=O)NC(=O)[C@H](Cc1ccc(F)cc1)NC(=O)[C@@H](NC(=O)c1cc(C)on1)C(C)C
: