Target
Estrogen receptor
Ligand
BDBM50076331
Substrate
Meas. Tech.
ChEMBL_67519 (CHEMBL682302)
Ki
0.1±n/a nM
Citation
 Endo, YIijima, TYamakoshi, YYamaguchi, MFukasawa, HShudo, K Potent estrogenic agonists bearing dicarba-closo-dodecaborane as a hydrophobic pharmacophore. J Med Chem 42:1501-4 (1999)  
Target
Name:
Estrogen receptor
Synonyms:
ER ESR ESR1_HUMAN Estrogen receptor Estrogen receptor (ER-alpha) Estrogen receptor alpha (ER) Nuclear receptor subfamily 3 group A member 1
Type:
Protein
Mol. Mass.:
66230.44
Organism:
Homo sapiens (Human)
Description:
P03372
Residue:
595
  
Inhibitor
Name:
BDBM50076331
Synonyms:
1-(hydroxymethyl)-12-(4-hydroxyphenyl)-1,12-dicarba-closo-dodecaborane | CHEMBL218274
Type:
Small organic molecule
Emp. Form.:
C10H11B10O2
Mol. Mass.:
271.303
SMILES:
C[B]1234[B]567[B]89%10[B]%11%12%13[B]%14%15%16[B]15([B]2%141[B]%11%152=[C]311(CO)[B]8%122[B]4691)[C]7%10%13%16c1ccc(O)cc1
: