Target
Kappa-type opioid receptor
Ligand
BDBM50039029
Substrate
Meas. Tech.
ChEBML_146531
Ki
3535±n/a nM
Citation
 Thomas, JBAtkinson, RNRothman, RBBurgess, JPMascarella, SWDersch, CMXu, HCarroll, FI 4-[(8-Alkyl-8-azabicyclo[3.2.1]octyl-3-yl)-3-arylanilino]-N,N-diethylbenzamides: high affinity, selective ligands for the delta opioid receptor illustrate factors important to antagonist activity. Bioorg Med Chem Lett 10:1281-4 (2000)  
Target
Name:
Kappa-type opioid receptor
Synonyms:
Kappa Opioid Receptor OPRK1 Opiate Kappa 1 | mu/kappa opioid receptor
Type:
G Protein-Coupled Receptor (GPCR)
Mol. Mass.:
42744.99
Organism:
Cavia porcellus (domestic guinea pig)
Description:
P41144
Residue:
380
  
Inhibitor
Name:
BDBM50039029
Synonyms:
(+)-4-((alpha R)-((2S,5R)-4-allyl-2,5-dimethylpiperazin-1-yl)(3-methoxyphenyl)methyl)-N,N-diethylbenzamide 3-[(4-Allyl-2,5-dimethyl-piperazin-1-yl)-(4-diethylcarbamoyl-phenyl)-methyl]-benzoic acid 4-((R)-((2S,5R)-4-allyl-2,5-dimethylpiperazin-1-yl)(3-methoxyphenyl)methyl)-N,N-diethylbenzamide 4-[(4-Allyl-2,5-dimethyl-piperazin-1-yl)-(3-methoxy-phenyl)-methyl]-N,N-diethyl-benzamide (SNC 80) 4-[(R)-((2R,5S)-4-Allyl-2,5-dimethyl-piperazin-1-yl)-(3-methoxy-phenyl)-methyl]-N,N-diethyl-benzamide 4-[(R)-((R)-4-(S)-Allyl-2,5-dimethyl-piperazin-1-yl)-(3-methoxy-phenyl)-methyl]-N,N-diethyl-benzamide 4-[(R)-[(2S,5R)-4-allyl-2,5-dimethylpiperazin-1-yl](3-methoxyphenyl)-methyl]-N,N-diethylbenzamide SNC-80
Type:
Small organic molecule
Emp. Form.:
C28H39N3O2
Mol. Mass.:
449.6282
SMILES:
CCN(CC)C(=O)c1ccc(cc1)[C@@H](N1C[C@@H](C)N(CC=C)C[C@@H]1C)c1cccc(OC)c1
: