Target
Thromboxane-A synthase
Ligand
BDBM50006551
Substrate
Meas. Tech.
ChEMBL_151518 (CHEMBL760420)
IC50
150±n/a nM
Citation
 Hartmann, RWHector, MWachall, BGPalusczak, APalzer, MHuch, VVeith, M Synthesis and evaluation of 17-aliphatic heterocycle-substituted steroidal inhibitors of 17alpha-hydroxylase/C17-20-lyase (P450 17). J Med Chem 43:4437-45 (2000)  
Target
Name:
Thromboxane-A synthase
Synonyms:
CYP5 Cytochrome P450 5A1 TBXAS1 TXA synthase TXS Thromboxane A2 Synthase (P450 TxA2) Thromboxane prostanoid Thromboxane-A synthase
Type:
Enzyme
Mol. Mass.:
60524.67
Organism:
Homo sapiens (Human)
Description:
P24557
Residue:
533
  
Inhibitor
Name:
BDBM50006551
Synonyms:
(+)3-(4-Amino-phenyl)-3-cyclohexyl-piperidine-2,6-dione 3-(4-Amino-phenyl)-3-cyclohexyl-piperidine-2,6-dione | CHEMBL70901
Type:
Small organic molecule
Emp. Form.:
C17H22N2O2
Mol. Mass.:
286.3688
SMILES:
Nc1ccc(cc1)C1(CCC(=O)NC1=O)C1CCCCC1
: