Target
Steroid 17-alpha-hydroxylase/17,20 lyase
Ligand
BDBM50409046
Substrate
Meas. Tech.
ChEMBL_50374 (CHEMBL661717)
IC50
9670±n/a nM
Citation
 Hartmann, RWHector, MWachall, BGPalusczak, APalzer, MHuch, VVeith, M Synthesis and evaluation of 17-aliphatic heterocycle-substituted steroidal inhibitors of 17alpha-hydroxylase/C17-20-lyase (P450 17). J Med Chem 43:4437-45 (2000)  
Target
Name:
Steroid 17-alpha-hydroxylase/17,20 lyase
Synonyms:
CP17A_RAT Cyp17a1 Cytochrome P450 17A1 Steroid 17-alpha-hydroxylase/17,20 lyase
Type:
Enzyme
Mol. Mass.:
57255.68
Organism:
Rattus norvegicus (Rat)
Description:
P11715
Residue:
507
  
Inhibitor
Name:
BDBM50409046
Synonyms:
CHEMBL2112782
Type:
Small organic molecule
Emp. Form.:
C21H31NO
Mol. Mass.:
313.4769
SMILES:
C[C@]12CC[C@H]3[C@@H](CC=C4C[C@@H](O)CC[C@]34C)C1=CC[C@@H]2[C@@H]1CN1
: