Target
Sigma non-opioid intracellular receptor 1
Ligand
BDBM50099825
Substrate
Meas. Tech.
ChEMBL_202070 (CHEMBL811340)
Ki
6.2±n/a nM
Citation
 Huang, YLuedtke, RRFreeman, RAWu, LMach, RH Synthesis and structure-activity relationships of naphthamides as dopamine D3 receptor ligands. J Med Chem 44:1815-26 (2001)  
Target
Name:
Sigma non-opioid intracellular receptor 1
Synonyms:
Aging-associated gene 8 protein SGMR1_HUMAN SIGMAR1 SR31747-binding protein Sigma 1-type opioid receptor Sigma1R | hSigmaR1
Type:
Enzyme Catalytic Domain
Mol. Mass.:
25124.85
Organism:
Homo sapiens (Human)
Description:
Q99720
Residue:
223
  
Inhibitor
Name:
BDBM50099825
Synonyms:
4-Bromo-1-methoxy-naphthalene-2-carboxylic acid (1-bicyclo[3.3.1]non-9-yl-pyrrolidin-3-yl)-amide | CHEMBL301302
Type:
Small organic molecule
Emp. Form.:
C25H31BrN2O2
Mol. Mass.:
471.43
SMILES:
COc1c(cc(Br)c2ccccc12)C(=O)N[C@@H]1CCN(C1)C1C2CCCC1CCC2
: