Target
Dual specificity mitogen-activated protein kinase kinase 1
Ligand
BDBM50099990
Substrate
Meas. Tech.
ChEMBL_60730 (CHEMBL672143)
IC50
3.6±n/a nM
Citation
 Zhang, NWu, BEudy, NWang, YYe, FPowell, DWissner, AFeldberg, LRKim, SCMallon, RKovacs, EDToral-Barza, LKohler, CA MEK (MAPKK) inhibitors. Part 2: structure-activity relationships of 4-anilino-3-cyano-6,7-dialkoxyquinolines. Bioorg Med Chem Lett 11:1407-10 (2001)  
Target
Name:
Dual specificity mitogen-activated protein kinase kinase 1
Synonyms:
Dual specificity mitogen-activated protein kinase (MEK) Dual specificity mitogen-activated protein kinase kinase 1 (MEK1) Dual specificity mitogen-activated protein kinase kinase MEK1/2 MAP kinase kinase 1 MAPK/ERK kinase 1 MEK-1 MP2K1_HUMAN PRKMK1 | VHL-MAP2K1/MAP2K2
Type:
Other Protein Type
Mol. Mass.:
43439.03
Organism:
Homo sapiens (Human)
Description:
Full-length human MEK-1 was generated by PCR and purified as a fusion protein from Escherichia coli lysates.
Residue:
393
  
Inhibitor
Name:
BDBM50099990
Synonyms:
4-(4-Benzyl-phenylamino)-6,7-dimethoxy-quinoline-3-carbonitrile | CHEMBL31806
Type:
Small organic molecule
Emp. Form.:
C25H21N3O2
Mol. Mass.:
395.4531
SMILES:
COc1cc2ncc(C#N)c(Nc3ccc(Cc4ccccc4)cc3)c2cc1OC
: