Target
Somatostatin receptor type 2
Ligand
BDBM50105469
Substrate
Meas. Tech.
ChEMBL_200991 (CHEMBL801242)
IC50
6.50±n/a nM
Citation
 Hay, BACole, BMDiCapua, FMKirk, GWMurray, MCNardone, RAPelletier, DJRicketts, APRobertson, ASSiegel, TW Small molecule somatostatin receptor subtype-2 antagonists. Bioorg Med Chem Lett 11:2731-4 (2001)  
Target
Name:
Somatostatin receptor type 2
Synonyms:
SOMATOSTATIN SST2 SS-2-R SS2R SSTR2 | Somatostatin receptor type 2 (SSTR2)
Type:
Enzyme
Mol. Mass.:
41344.94
Organism:
Homo sapiens (Human)
Description:
P30874
Residue:
369
  
Inhibitor
Name:
BDBM50105469
Synonyms:
(S)-6-Amino-2-((R)-3-(1H-indol-3-yl)-2-{[4-(2-oxo-2,3-dihydro-benzoimidazol-1-yl)-piperidine-1-carbonyl]-amino}-propionylamino)-hexanoic acid tert-butyl ester | CHEMBL93859
Type:
Small organic molecule
Emp. Form.:
C34H45N7O5
Mol. Mass.:
631.765
SMILES:
CC(C)(C)OC(=O)[C@H](CCCCN)NC(=O)[C@@H](Cc1c[nH]c2ccccc12)NC(=O)N1CCC(CC1)n1c2ccccc2[nH]c1=O
: