Target
Long-chain-fatty-acid--CoA ligase 1
Ligand
BDBM50549462
Substrate
Meas. Tech.
ChEMBL_2024886 (CHEMBL4678699)
IC50
34±n/a nM
Citation
 Hayashi, KKondo, NOmori, NYoshimoto, RHato, MShigaki, SNagasawa, AIto, MOkuno, T Discovery of a benzimidazole series as the first highly potent and selective ACSL1 inhibitors. Bioorg Med Chem Lett 33:0 (2021)  
Target
Name:
Long-chain-fatty-acid--CoA ligase 1
Synonyms:
6.2.1.15 6.2.1.3 ACSL1 Acyl-CoA synthetase 1 FACL1 LACS LACS 2 LACS2 Long-chain acyl-CoA synthetase 2 Long-chain-fatty-acid--CoA ligase 1 Palmitoyl-CoA ligase 2 Synonyms=FACL1
Type:
PROTEIN
Mol. Mass.:
77946.51
Organism:
Homo sapiens
Description:
ChEMBL_117991
Residue:
698
  
Inhibitor
Name:
BDBM50549462
Synonyms:
CHEMBL4749130
Type:
Small organic molecule
Emp. Form.:
C23H26N6O
Mol. Mass.:
402.4921
SMILES:
Cc1cccc(Cc2nc3cc(O[C@H]4CC[C@H](CC4)c4nnn[nH]4)ccc3n2C)c1
: