Target
Genome polyprotein
Ligand
BDBM50111454
Substrate
Meas. Tech.
ChEMBL_158813 (CHEMBL761622)
EC50
2±n/a nM
Citation
 Dragovich, PSPrins, TJZhou, RBrown, ELMaldonado, FCFuhrman, SAZalman, LSTuntland, TLee, CAPatick, AKMatthews, DAHendrickson, TFKosa, MBLiu, BBatugo, MRGleeson, JPSakata, SKChen, LGuzman, MCMeador, JWFerre, RAWorland, ST Structure-based design, synthesis, and biological evaluation of irreversible human rhinovirus 3C protease inhibitors. 6. Structure-activity studies of orally bioavailable, 2-pyridone-containing peptidomimetics. J Med Chem 45:1607-23 (2002)  
Target
Name:
Genome polyprotein
Synonyms:
Human rhinovirus A protease | Human rhinovirus B 3A protease
Type:
PROTEIN
Mol. Mass.:
44361.04
Organism:
Human rhinovirus B
Description:
ChEMBL_158953
Residue:
401
  
Inhibitor
Name:
BDBM50111454
Synonyms:
4-(3-(4-Fluoro-phenyl)-2-{3-[(5-methyl-isoxazole-3-carbonyl)-amino]-2-oxo-2H-pyridin-1-yl}-propionylamino)-5-(2-oxo-pyrrolidin-3-yl)-pent-2-enoic acid ethyl ester | CHEMBL289920
Type:
Small organic molecule
Emp. Form.:
C30H32FN5O7
Mol. Mass.:
593.6028
SMILES:
CCOC(=O)\C=C\[C@H](C[C@@H]1CCNC1=O)NC(=O)[C@H](Cc1ccc(F)cc1)n1cccc(NC(=O)c2cc(C)on2)c1=O
: